intellij idea – Erro de compilação do Maven: Falha ao executar o objetivo org.apache.maven.plugins: maven-compiler-plugin: 3.1: compilar no projeto Maven

estou tendo esse erro ao tentar executar a compilação Marvin

“C:Program FilesJavajdk1.8.0_111binjava.exe” -Dmaven.multiModuleProjectDirectory=C:UsersUserDocumentsglobalexemplo.marvenok “-Dmaven.home=C:Program FilesJetBrainsIntelliJ IDEA Community Edition 2020.3.1pluginsmavenlibmaven3” “-Dclassworlds.conf=C:Program FilesJetBrainsIntelliJ IDEA Community Edition 2020.3.1pluginsmavenlibmaven3binm2.conf” “-Dmaven.ext.class.path=C:Program FilesJetBrainsIntelliJ IDEA Community Edition 2020.3.1pluginsmavenlibmaven-event-listener.jar” “-javaagent:C:Program FilesJetBrainsIntelliJ IDEA Community Edition 2020.3.1libidea_rt.jar=60347:C:Program FilesJetBrainsIntelliJ IDEA Community Edition 2020.3.1bin” -Dfile.encoding=UTF-8 -classpath “C:Program FilesJetBrainsIntelliJ IDEA Community Edition 2020.3.1pluginsmavenlibmaven3bootplexus-classworlds-2.6.0.jar;C:Program FilesJetBrainsIntelliJ IDEA Community Edition 2020.3.1pluginsmavenlibmaven3bootplexus-classworlds.license” org.codehaus.classworlds.Launcher -Didea.version=2020.3.1 install
(INFO) Scanning for projects…
(INFO)
(INFO) ——————< br.com.globallabs:exemplo.marven >——————
(INFO) Building exemplo.marven 0.0.1-SNAPSHOT
(INFO) ——————————–( jar )———————————
(INFO)
(INFO) — maven-resources-plugin:3.2.0:resources (default-resources) @ exemplo.marven —
(INFO) Using ‘UTF-8’ encoding to copy filtered resources.
(INFO) Using ‘UTF-8’ encoding to copy filtered properties files.
(INFO) Copying 1 resource
(INFO) Copying 0 resource
(INFO)
(INFO) — maven-compiler-plugin:3.8.1:compile (default-compile) @ exemplo.marven —
(INFO) Changes detected – recompiling the module!
(INFO) Compiling 1 source file to C:UsersUserDocumentsglobalexemplo.marvenoktargetclasses
(INFO) ————————————————————————
(INFO) BUILD FAILURE
(INFO) ————————————————————————
(INFO) Total time: 2.888 s
(INFO) Finished at: 2021-01-17T12:49:37-03:00
(INFO) ————————————————————————
(ERROR) Failed to execute goal org.apache.maven.plugins:maven-compiler-plugin:3.8.1:compile (default-compile) on project exemplo.marven: Fatal error compiling: invalid target release: 11 -> (Help 1)
(ERROR)
(ERROR) To see the full stack trace of the errors, re-run Maven with the -e switch.
(ERROR) Re-run Maven using the -X switch to enable full debug logging.
(ERROR)
(ERROR) For more information about the errors and possible solutions, please read the following articles:
(ERROR) (Help 1) http://cwiki.apache.org/confluence/display/MAVEN/MojoExecutionException

Process finished with exit code 1

(INFO)
(INFO) ——————< br.com.globallabs:exemplo.marven >——————
(INFO) Building exemplo.marven 0.0.1-SNAPSHOT
(INFO) ——————————–( jar )———————————
(INFO)
(INFO) — maven-resources-plugin:3.2.0:resources (default-resources) @ exemplo.marven —
(INFO) Using ‘UTF-8’ encoding to copy filtered resources.
(INFO) Using ‘UTF-8’ encoding to copy filtered properties files.
(INFO) Copying 1 resource
(INFO) Copying 0 resource
(INFO)
(INFO) — maven-compiler-plugin:3.8.1:compile (default-compile) @ exemplo.marven —
(INFO) Changes detected – recompiling the module!
(INFO) Compiling 1 source file to C:UsersUserDocumentsglobalexemplo.marvenoktargetclasses

(INFO)
(INFO) — maven-compiler-plugin:3.8.1:compile (default-compile) @ exemplo.marven —
(INFO) Changes detected – recompiling the module!
(INFO) Compiling 1 source file to C:UsersUserDocumentsglobalexemplo.marvenoktargetclasses

Failed to execute goal org.apache.maven.plugins:maven-compiler-plugin:3.8.1:compile (default-compile) on project exemplo.marven: Fatal error compiling

Olá!!! Como faço o casting desse exercício em C# de double para int? SEGUE O QUE CONSEGUI EXECUTAR ATÉ AGORA

using System;
using System.Globalization;

namespace _1021_2
{
class Program
{
static void Main(string() args)

    {
        double N;
        int quociente, resto, nota, moeda;

        N = double.Parse(Console.ReadLine(), CultureInfo.InvariantCulture);

       

        resto = (int)(N * 100, 0 + 0, 5);

        Console.WriteLine(" NOTAS: ");

        nota = 100;
        quociente = resto / (nota * 100);
        Console.WriteLine(quociente + " nota (s) de R $ " + nota + " .00 ");
        resto = resto % (nota * 100);

        nota = 50;
        quociente = resto / (nota * 100);
        Console.WriteLine(quociente + " nota (s) de R $ " + nota + " .00 ");
        resto = resto % (nota * 100);

        nota = 20;
        quociente = resto / (nota * 100);
        Console.WriteLine(quociente + " nota (s) de R $ " + nota + " .00 ");
        resto = resto % (nota * 100);

        nota = 10;
        quociente = resto / (nota * 100);
        Console.WriteLine(quociente + " nota (s) de R $ " + nota + " .00 ");
        resto = resto % (nota * 100);

        nota = 5;
        quociente = resto / (nota * 100);
        Console.WriteLine(quociente + " nota (s) de R $ " + nota + " .00 ");
        resto = resto % (nota * 100);

        nota = 2;
        quociente = resto / (nota * 100);
        Console.WriteLine(quociente + " nota (s) de R $ " + nota + " .00 ");
        resto = resto % (nota * 100);

        nota = 1;
        quociente = resto / (nota * 100);
        Console.WriteLine(quociente + " nota (s) de R $ " + nota + " .00 ");
        resto = resto % (nota * 100);



        Console.WriteLine(" MOEDAS ");

        moeda = 100;
        quociente = resto / (nota * 100);
        Console.WriteLine(quociente + " nota (s) de R $ " + nota + " .00 ");
        resto = resto % (nota * 100);

        moeda = 50;
        quociente = resto / (nota * 100);
        Console.WriteLine(quociente + " nota (s) de R $ " + nota + " .00 ");
        resto = resto % (nota * 100);

        moeda = 20;
        quociente = resto / (nota * 100);
        Console.WriteLine(quociente + " nota (s) de R $ " + nota + " .00 ");
        resto = resto % (nota * 100);

        moeda = 10;
        quociente = resto / (nota * 100);
        Console.WriteLine(quociente + " nota (s) de R $ " + nota + " .00 ");
        resto = resto % (nota * 100);

        moeda = 5;
        quociente = resto / (nota * 100);
        Console.WriteLine(quociente + " nota (s) de R $ " + nota + " .00 ");
        resto = resto % (nota * 100);

        moeda = 2;
        quociente = resto / (nota * 100);
        Console.WriteLine(quociente + " nota (s) de R $ " + nota + " .00 ");
        resto = resto % (nota * 100);

        moeda = 1;
        quociente = resto / (nota * 100);
        Console.WriteLine(quociente + " nota (s) de R $ " + nota + " .00 ");
        resto = resto % (nota * 100);

        Console.WriteLine(resto + " moeda (s) de R $ 0,01 ");


    }
}

}

Estou fazendo um projeto que, uso react bootstrap e quando fui executar pareceu esse erro!

Error: Node Sass version 5.0.0 is incompatible with ^4.0.0.
Como faço para atualizar

mysql – Heroku – Erro executar seeder para popular BD

Olá.

Recentemente realizei o deploy de uma aplicação no heroku (Node + Adonis + MySql + React) e estou enfrentando alguns probleminhas. Ela possui um usuário admin que é responsável por cadastrar outros usuários, então eu possuo alguns seeders para popular o banco com alguns dados e os usuários (admin e usuario comum). Para rodar os seeders no heroku eu utilzei o seguinte comando.

heroku run -a allocate-ufc-back ENV_SILENT=true node ace seed --force

Após utilizar esse comando ele gera o seguinte erro:

Print do erro

É como se não existisse a coluna, ou algo assim, pelo menos foi o que eu entendi. Eu não sei como faço para visualizar as tabelas do meu banco no heroku por isso não da pra saber se está conectando corretamente. Se alguém pudesse me ajudar a identificar qual o problema ou dizer como rodar o seeders corretamente ficaria muito grata. Detalhe: as migrations foram executadas normalmente.

método – Como executar um procedimento em que seu nome seja o valor de uma variável? (em c#)

Eu gostaria de saber se é possível e como, executar um método / procedimento a partir do valor de uma variável. Sei que isso é possível em Java mas desconheço no caso da Linguagem C#.

Seria basicamente:

public static void Main(String()args){
    string variávelX = "funcao1";
    
    
    //esboço abaixo
    
    variávelX();
    
    //fim do esboço
    
    /*
    
    basicamente que o nome do método a ser executado seja flexível ao valor da variável que refere o nome do método
    
    */
}
    
    public static void funcao1(){
    
       Console.WriteLine("Função 1");
    }
    
    public static void funcao2(){
    
       Console.WriteLine("Função 2")
    }
        

Problema ao executar o comando "npx create-nuxt-app"" no windows

Olá! Estava prestes a iniciar um projeto NuxtJS, quando fui rodar o comando de instalação e me deparei com um erro. Alguém poderia me orientar a resolver esse problema? Já tentei de tudo e ainda não obtive resultados. Desde já agradeço.Esse é o problema.

java – Erro ao executar teste de um data source sql server no was 8.5

Erro ao testar a conexão do data source SQL Server no servidor WebSphere 8.5 com java 8 dá o seguinte erro:

The driver could not establish a secure connection to SQL Server by using Secure Sockets Layer (SSL) encryption. Error: “No appropriate protocol, may be no appropriate cipher suite specified or protocols are deactivated”. DSRA0010E: Estado de SQL = 08S01, Código de Erro = 0.

(!(Erro ao testar o datasource pelo websphere)(1))(1)

Tentei alterar as configurações de confiabilidade do was, porém nada aconteceu. OBS.: Esse meu WebSphere foi copiado de outra máquina, que também está apresentando o mesmo problema. E só conseguimos testar os datasources do DB2, mas pra sql server dá erro.

typescript – Estou tentando executar o comando npm install para incluir o typescrypt no meu projeto mas aparece a mensagem abaixo, como resolver isso?

npm ERR! code EJSONPARSE
npm ERR! file C:UsersfelipcursosCodeEasyJavaScriptES6eProgramacaoFuncionaltypescriptaula1package.json
npm ERR! JSON.parse Failed to parse json
npm ERR! JSON.parse Unexpected token v in JSON at position 0 while parsing near ‘v12.18.2
npm ERR! JSON.parse ‘
npm ERR! JSON.parse Failed to parse package.json data.
npm ERR! JSON.parse package.json must be actual JSON, not just JavaScript.

Erro ao tentar executar projeto React Native jest-haste-map: Haste module naming collision: mobile

Estou tentando executar meu projeto em meu dispositivo mobile e esta dando o seguinte erro abaixo, referente a duplicação de arquivos.

    jest-haste-map: Haste module naming collision: mobile
  The following files share their name; please adjust your hasteImpl:
    * <rootDir>mobilepackage.json
    * <rootDir>package.json

Failed to construct transformer:  DuplicateError: Duplicated files or mocks. Please check the console for more info
    at setModule (C:curso-rocketbootcamp-nivel-01_node-js_react-js_react-native_typescriptmobilenode_modulesmetronode_modulesjest-haste-mapbuildindex.js:620:17)
    at workerReply (C:curso-rocketbootcamp-nivel-01_node-js_react-js_react-native_typescriptmobilenode_modulesmetronode_modulesjest-haste-mapbuildindex.js:691:9)
    at processTicksAndRejections (internal/process/task_queues.js:93:5)
    at async Promise.all (index 1) {
  mockPath1: 'mobile\package.json',
  mockPath2: 'package.json'
}
Error: Duplicated files or mocks. Please check the console for more info
    at setModule (C:curso-rocketbootcamp-nivel-01_node-js_react-js_react-native_typescriptmobilenode_modulesmetronode_modulesjest-haste-mapbuildindex.js:620:17)
    at workerReply (C:curso-rocketbootcamp-nivel-01_node-js_react-js_react-native_typescriptmobilenode_modulesmetronode_modulesjest-haste-mapbuildindex.js:691:9)
    at processTicksAndRejections (internal/process/task_queues.js:93:5)
    at async Promise.all (index 1)

selenium webdriver – Ao executar protractor-flakes o mesmo apresenta falha de leitura da proriedade presenceOf – Angularjs

protractor-flake –parser standard –max-attempts=2 — e2e/protractor.conf.js

Deve avaliar bloqueio e desbloqueio de valores para unidades filhas
– Failed: Cannot read property ‘presenceOf’ of undefined
at PEBOMonthlyBudget.navigateToMonthlyBudget (/home/aldeba/workspaceAngular/plataforma/front/e2e/src/monthly-budget/monthly-budget.po.ts:36:25)
at PEBOMonthlyBudget.navigateMonthlyBudget (/home/aldeba/workspaceAngular/plataforma/front/e2e/src/monthly-budget/monthly-budget.po.ts:54:14)
at UserContext. (/home/aldeba/workspaceAngular/plataforma/front/e2e/src/monthly-budget/monthly-budget.spec.ts:143:27)
at /usr/local/lib/node_modules/protractor/node_modules/jasminewd2/index.js:112:25
at new ManagedPromise (/usr/local/lib/node_modules/protractor/node_modules/selenium-webdriver/lib/promise.js:1077:7)
at ControlFlow.promise (/usr/local/lib/node_modules/protractor/node_modules/selenium-webdriver/lib/promise.js:2505:12)
at schedulerExecute (/usr/local/lib/node_modules/protractor/node_modules/jasminewd2/index.js:95:18)
at TaskQueue.execute_ (/usr/local/lib/node_modules/protractor/node_modules/selenium-webdriver/lib/promise.js:3084:14)
at TaskQueue.executeNext_ (/usr/local/lib/node_modules/protractor/node_modules/selenium-webdriver/lib/promise.js:3067:27)
at /usr/local/lib/node_modules/protractor/node_modules/selenium-webdriver/lib/promise.js:2974:25
From: Task: Run it(“Deve avaliar bloqueio e desbloqueio de valores para unidades filhas”) in control flow
at UserContext. (/usr/local/lib/node_modules/protractor/node_modules/jasminewd2/index.js:94:19)
From asynchronous test:
Error:
at Suite. (/home/aldeba/workspaceAngular/plataforma/front/e2e/src/monthly-budget/monthly-budget.spec.ts:136:5)
at Object. (/home/aldeba/workspaceAngular/plataforma/front/e2e/src/monthly-budget/monthly-budget.spec.ts:16:1)
at Module._compile (internal/modules/cjs/loader.js:1137:30)
at Module.m._compile (/home/aldeba/workspaceAngular/plataforma/front/node_modules/ts-node/src/index.ts:473:23)
at Module._extensions..js (internal/modules/cjs/loader.js:1157:10)
at Object.require.extensions. (as .ts) (/home/aldeba/workspaceAngular/plataforma/front/node_modules/ts-node/src/index.ts:476:12)



…….

  1. Monthly Budget *** – Deve avaliar bloqueio e desbloqueio de valores para unidades filhas
  • Failed: Cannot read property ‘presenceOf’ of undefined

Alguma dica para correção?
Grato.